Recent

Author Topic: [SOLVED] Android: Error building APK (Gradle) after LAMW update  (Read 175 times)

jluixjurado

  • New Member
  • *
  • Posts: 17
[SOLVED] Android: Error building APK (Gradle) after LAMW update
« on: September 19, 2022, 07:39:32 pm »
Hi there!

After updating LAMW I'm unable to exec even the simpler programs in my phone. After compiling successfully I got:
Error: ..\AppLAMWProject1\src\org\lamw\applamwproject1\jSupported.java:6: error: package androidx.core.content does not exist
Error: ..\AppLAMWProject1\src\org\lamw\applamwproject1\jSupported.java:17: error: cannot find symbol
Error: ..\AppLAMWProject1\src\org\lamw\applamwproject1\jSupported.java:31: error: cannot find symbol
Fatal: FAILURE: Build failed with an exception.

I've reinstalled everything twice with any luck. Before the updating everything went right.

Could you help me?

Thanks in advance.
« Last Edit: September 29, 2022, 05:38:27 pm by jluixjurado »

jmpessoa

  • Hero Member
  • *****
  • Posts: 2149
Re: Android: Error building APK (Gradle) after LAMW update
« Reply #1 on: September 19, 2022, 08:42:37 pm »
Hi, jluixjurado!


Please, put your project folder (zip it!) in some open drive... I will try help you.

Edited!!!  Fixed!

Please, update your LAMW from github...

Thank you!
« Last Edit: September 20, 2022, 12:48:58 am by jmpessoa »
Lamw: Lazarus Android Module Wizard
https://github.com/jmpessoa/lazandroidmodulewizard

jluixjurado

  • New Member
  • *
  • Posts: 17
Re: Android: Error building APK (Gradle) after LAMW update
« Reply #2 on: September 20, 2022, 10:38:54 am »
Fixed!

Thank you very much!

 

TinyPortal © 2005-2018