Forum > Third party

Fpcupdeluxe

<< < (408/408)

fabiopesaju:

--- Code: Pascal  [+][-]window.onload = function(){var x1 = document.getElementById("main_content_section"); if (x1) { var x = document.getElementsByClassName("geshi");for (var i = 0; i < x.length; i++) { x[i].style.maxHeight='none'; x[i].style.height = Math.min(x[i].clientHeight+15,306)+'px'; x[i].style.resize = "vertical";}};} ---make.exe[2]: Leaving directory `C:/fpcupdeluxe/fpcsrc/utils'make.exe[1]: Leaving directory `C:/fpcupdeluxe/fpcsrc'echo Build > build-stamp.x86_64-win64echo Build > base.build-stamp.x86_64-win64C:/fpcupdeluxe/fpcbootstrap/make.exe installbase FPC=C:/fpcupdeluxe/fpcsrc/compiler/ppcx64.exe ZIPDESTDIR=C:/fpcupdeluxe/fpcsrc FPCMAKE=C:/fpcupdeluxe/fpcsrc/utils/fpcm/bin/x86_64-win64/fpcmake.exemake.exe[1]: Entering directory `C:/fpcupdeluxe/fpcsrc'C:/fpcupdeluxe/fpcbootstrap/ginstall.exe -m 755 -d C:\fpcupdeluxe\fpcmake (e=14001): Error 14001make.exe[1]: *** [installbase] Error 14001make.exe[1]: Leaving directory `C:/fpcupdeluxe/fpcsrc'C:\fpcupdeluxe\fpcbootstrap\make.exe: *** [installall] Error 2C:\fpcupdeluxe\fpcbootstrap\make.exe: Leaving directory `C:/fpcupdeluxe/fpcsrc' fpcupdeluxe: ERROR: FPCNativeInstaller (CleanModule: FPC): Error running C:\fpcupdeluxe\fpcbootstrap\make.exe for FPC failed with exit code 2. Details:   ERROR: Fpcupdeluxe fatal error !Sequencer (FPC): Failure running fpcupdeluxe: error executing sequence FPCSequencer (Default): Failure running fpcupdeluxe: error executing sequence Default
can someone please help me?




elmar faber:
Hello,

I try to install it on the following system: odroid C1+ with ubuntu 20.04
and get the following error (stable and trunk):

(3104) Compiling ./frames/env_file_filters.pas
(3104) Compiling ./frames/project_application_optiError: /home/odroid/fpcupdeluxe/fpc/bin/arm-linux/ppcarm can't be executed, error message: Failed to execute "/home/odroid/fpcupdeluxe/fpc/bin/arm-linux/ppcarm", error code: -9
make[2]: *** [Makefile:4667: lazarus] Fehler 1
make[1]: *** [Makefile:5103: ide] Fehler 2
make: *** [Makefile:3789: ide] Fehler 2
make[2]: Verzeichnis „/home/odroid/fpcupdeluxe/lazarus/ide“ wird verlassen
make[1]: Verzeichnis „/home/odroid/fpcupdeluxe/lazarus/ide“ wird verlassen
make: Verzeichnis „/home/odroid/fpcupdeluxe/lazarus“ wird verlassen
fpcupdeluxe: ERROR: LazarusNativeInstaller (BuildModuleCustom: Lazarus): make returned exit status #512

ERROR: Fpcupdeluxe fatal error !
Sequencer (LazarusSimple): Failure running fpcupdeluxe: error executing sequence LazarusSimple
Sequencer (DefaultSimple): Failure running fpcupdeluxe: error executing sequence DefaultSimple

Is there a chance to solve the problem?

Best regards

Navigation

[0] Message Index

[*] Previous page

Go to full version