Recent

Author Topic: [SOLVED]SVN 31996 Error  (Read 4480 times)

IndianaJones

  • Hero Member
  • *****
  • Posts: 509
[SOLVED]SVN 31996 Error
« on: August 16, 2011, 08:58:08 pm »
Hi,
I have encountered the following error when I am doing SVN installation.

Compiling extractproctool.pas
eventcodetool.pas(1012,23) Error: identifier idents no member "UnitName"
eventcodetool.pas(1408) Fatal: There were 1 errors compiling module, stopping
Fatal: Compilation aborted
make[2]: *** [codetools.ppu] Error 1
make[2]: Leaving directory `/home/cemzafer/lazarus/components/codetools'
make[1]: *** [codetools_all] Error 2
make[1]: Leaving directory `/home/cemzafer/lazarus/components'
make: *** [bigidecomponents] Error 2

Have someone any idea? or Is it a temporary SVN error.
Thanks.
Ubuntu 11.04
« Last Edit: August 17, 2011, 07:56:01 am by IndianaJones »

IndianaJones

  • Hero Member
  • *****
  • Posts: 509
Re: SVN 31996 Error
« Reply #1 on: August 17, 2011, 07:55:29 am »

The mentioned error occurs when I do compiling with FPC 2.4.0 Ubuntu Packages.
I tried with FPC 2.4.4 and everything is fine.

JuhaManninen

  • Global Moderator
  • Hero Member
  • *****
  • Posts: 3652
  • I like bugs.
Re: SVN 31996 Error
« Reply #2 on: August 17, 2011, 08:02:36 am »
The mentioned error occurs when I do compiling with FPC 2.4.0 Ubuntu Packages.
I tried with FPC 2.4.4 and everything is fine.

That was the correct fix. Lazarus trunk does not support FPC 2.4.0.

Juha